BDBM50025885 CHEMBL3335228
SMILES COc1ccc(Br)cc1\C=N\c1ccc2[nH]c(=O)[nH]c2c1
InChI Key InChIKey=YKCMOTYUIDEACC-CAOOACKPSA-N
Data  2 IC50
  Tab Delimited (TSV)   2D SDfile   Computed 3D by Vconf -m prep SDfile
Find this compound or compounds like it in BindingDB:
Activity Spreadsheet -- Enzyme Inhibition Constant Data from BindingDB
Found 2 hits for monomerid = 50025885
TargetProtein-tyrosine kinase 6(Homo sapiens (Human))
Yonsei University
Curated by ChEMBL
LigandPNGBDBM50025885(CHEMBL3335228)
Affinity DataIC50:  1.71E+4nM. Assay description: Inhibition of GST-tagged PTK6 (unknown origin) assessed as phosphorylated tyrosines after 20 mins by ELISA
In DepthDetails ArticlePubMed
TargetProtein-tyrosine kinase 6(Homo sapiens (Human))
Yonsei University
Curated by ChEMBL
LigandPNGBDBM50025885(CHEMBL3335228)
Affinity DataIC50: >1.00E+5nM. Assay description: Inhibition of PTK6 (unknown origin) expressed in HEK293 cells assessed as decrease in tyrosine phosphorylation by chemiluminescence assay
In DepthDetails ArticlePubMed