BDBM50025925 CHEMBL3335254
SMILES CCOc1cc(Br)c(Br)c(\C=N\c2ccc3scnc3c2)c1O
InChI Key InChIKey=BZOMOAATOQLIJB-FBCYGCLPSA-N
Data  2 IC50
  Tab Delimited (TSV)   2D SDfile   Computed 3D by Vconf -m prep SDfile
Find this compound or compounds like it in BindingDB:
Activity Spreadsheet -- Enzyme Inhibition Constant Data from BindingDB
Found 2 hits for monomerid = 50025925
TargetProtein-tyrosine kinase 6(Homo sapiens (Human))
Yonsei University
Curated by ChEMBL
LigandPNGBDBM50025925(CHEMBL3335254)
Affinity DataIC50:  2.54E+3nM. Assay description: Inhibition of PTK6 (unknown origin) expressed in HEK293 cells assessed as decrease in tyrosine phosphorylation by chemiluminescence assay
In DepthDetails ArticlePubMed
TargetProtein-tyrosine kinase 6(Homo sapiens (Human))
Yonsei University
Curated by ChEMBL
LigandPNGBDBM50025925(CHEMBL3335254)
Affinity DataIC50:  1.17E+3nM. Assay description: Inhibition of GST-tagged PTK6 (unknown origin) assessed as phosphorylated tyrosines after 20 mins by ELISA
In DepthDetails ArticlePubMed