BDBM50026181 CHEMBL3338169
SMILES CCc1cnc(nc1)N1CCC(CC1)Oc1ccn(-c2ccc(cc2)S(C)(=O)=O)c(=O)c1
InChI Key InChIKey=DJOMJPWMQCDQQR-UHFFFAOYSA-N
Data  1 EC50
  Tab Delimited (TSV)   2D SDfile   Computed 3D by Vconf -m prep SDfile
Find this compound or compounds like it in BindingDB:
Activity Spreadsheet -- Enzyme Inhibition Constant Data from BindingDB
Found 1 hit for monomerid = 50026181
TargetGlucose-dependent insulinotropic receptor(Homo sapiens (Human))
Departments Of Discovery Chemistry, Metabolic Diseases, Lead Evaluation, Computer-Assisted Drug Design, Discovery Toxicology, Exploratory Clinical And Translational Research, And Pharmaceutical Candi
Curated by ChEMBL
LigandPNGBDBM50026181(CHEMBL3338169)
Affinity DataEC50:  57nM. Assay description: Agonist activity at human GPR119
In DepthDetails ArticlePubMed