BDBM50026237 CHEMBL3338191
SMILES CS(=O)(=O)c1ccc(cc1F)-n1cc(Cl)c(OC2CCN(CC2)c2ncc(cn2)C(F)(F)F)cc1=O
InChI Key InChIKey=QUKGFPUNFKSRAB-UHFFFAOYSA-N
Data  1 EC50
  Tab Delimited (TSV)   2D SDfile   Computed 3D by Vconf -m prep SDfile
Find this compound or compounds like it in BindingDB:
Activity Spreadsheet -- Enzyme Inhibition Constant Data from BindingDB
Found 1 hit for monomerid = 50026237
TargetGlucose-dependent insulinotropic receptor(Homo sapiens (Human))
Departments Of Discovery Chemistry, Metabolic Diseases, Lead Evaluation, Computer-Assisted Drug Design, Discovery Toxicology, Exploratory Clinical And Translational Research, And Pharmaceutical Candi
Curated by ChEMBL
LigandPNGBDBM50026237(CHEMBL3338191)
Affinity DataEC50:  16nM. Assay description: Agonist activity at human GPR119
In DepthDetails ArticlePubMed