BDBM50026293 3-({1-[2-tert-Butoxycarbonylamino-3-(1H-indol-3-yl)-propionyl]-pyrrolidine-2-carbonyl}-amino)-succinamic acid::CHEMBL95063
SMILES CC(C)(C)OC(=O)N[C@@H](Cc1c[nH]c2ccccc12)C(=O)N1CCC[C@H]1C(=O)N[C@@H](CC(O)=O)C(N)=O
InChI Key InChIKey=KCZPYRUXPDHPJX-FHWLQOOXSA-N
Data  1 IC50
  Tab Delimited (TSV)   2D SDfile   Computed 3D by Vconf -m prep SDfile
Find this compound or compounds like it in BindingDB:
Activity Spreadsheet -- Enzyme Inhibition Constant Data from BindingDB
Found 1 hit for monomerid = 50026293
TargetHistamine H2 receptor(RAT)
TBA
Curated by ChEMBL
LigandPNGBDBM50026293(3-({1-[2-tert-Butoxycarbonylamino-3-(1H-indol-3-yl...)
Affinity DataIC50:  1.00E+5nM. Assay description: Inhibitory activity against binding of [125I](Nle11)-HG-13 to Histamine H2 receptor in vitro
In DepthDetails ArticlePubMed