BDBM50026294 CHEMBL329524::[1-[1-(1-Carbamoyl-ethylcarbamoyl)-3-methyl-butylcarbamoyl]-2-(1H-indol-3-yl)-ethyl]-carbamic acid tert-butyl ester
SMILES CC(C)C[C@H](NC(=O)[C@H](Cc1c[nH]c2ccccc12)NC(=O)OC(C)(C)C)C(=O)N[C@@H](C)C(N)=O
InChI Key InChIKey=HKHAAIISQKVNDB-YSSFQJQWSA-N
Data  1 IC50
  Tab Delimited (TSV)   2D SDfile   Computed 3D by Vconf -m prep SDfile
Find this compound or compounds like it in BindingDB:
Activity Spreadsheet -- Enzyme Inhibition Constant Data from BindingDB
Found 1 hit for monomerid = 50026294
TargetHistamine H2 receptor(RAT)
TBA
Curated by ChEMBL
LigandPNGBDBM50026294(CHEMBL329524 | [1-[1-(1-Carbamoyl-ethylcarbamoyl)-...)
Affinity DataIC50:  1.50E+5nM. Assay description: Inhibitory activity against binding of [125I](Nle11)-HG-13 to Histamine H2 receptor in vitro
In DepthDetails ArticlePubMed