BDBM50026326 CHEMBL3305928
SMILES CCCCOP(O)(=O)C(C)=O
InChI Key InChIKey=JGFBWABEUCASTP-UHFFFAOYSA-N
Data  2 KI
  Tab Delimited (TSV)   2D SDfile   Computed 3D by Vconf -m prep SDfile
Find this compound or compounds like it in BindingDB:
Activity Spreadsheet -- Enzyme Inhibition Constant Data from BindingDB
Found 2 hits for monomerid = 50026326
Target1-deoxy-D-xylulose-5-phosphate synthase(Mycobacterium tuberculosis)
University Of Groningen
Curated by ChEMBL
LigandPNGBDBM50026326(CHEMBL3305928)
Affinity DataKi:  4.00E+3nM. Assay description: Inhibition of Mycobacterium tuberculosis DXS
In DepthDetails ArticlePubMed
Target1-deoxy-D-xylulose-5-phosphate synthase(Escherichia coli O127:H6 (strain E2348/69 / EPEC))
University Of Groningen
Curated by ChEMBL
LigandPNGBDBM50026326(CHEMBL3305928)
Affinity DataKi:  5.60E+3nM. Assay description: Inhibition of Escherichia coli DXS
In DepthDetails ArticlePubMed