BDBM50026388 CHEMBL3331278
SMILES Cc1nc2ccc(Cl)cc2c(=O)n1CC(=O)Nc1ccccc1
InChI Key InChIKey=NYHMMHKERDYLME-UHFFFAOYSA-N
Data  1 IC50
  Tab Delimited (TSV)   2D SDfile   Computed 3D by Vconf -m prep SDfile
Find this compound or compounds like it in BindingDB:
Activity Spreadsheet -- Enzyme Inhibition Constant Data from BindingDB
Found 1 hit for monomerid = 50026388
TargetEnoyl-[acyl-carrier-protein] reductase [NADH](Mycobacterium tuberculosis (strain ATCC 25618 / H3...)
Birla Institute Of Technology
Curated by ChEMBL
LigandPNGBDBM50026388(CHEMBL3331278)
Affinity DataIC50:  3.12E+3nM. Assay description: Inhibition of Mycobacterium tuberculosis recombinant InhA expressed in Escherichia coli BL21 (DE3) using 2-trans-decenoyl substrate by spectrophotome...
In DepthDetails ArticlePubMed