BDBM50026601 CHEMBL3335352
SMILES Oc1cccc(c1)C(=O)c1cc2cc(O)ccc2[nH]1
InChI Key InChIKey=DMVGFIMILGTPFV-UHFFFAOYSA-N
Data  2 IC50
  Tab Delimited (TSV)   2D SDfile   Computed 3D by Vconf -m prep SDfile
Find this compound or compounds like it in BindingDB:
Activity Spreadsheet -- Enzyme Inhibition Constant Data from BindingDB
Found 2 hits for monomerid = 50026601
TargetDual specificity protein kinase CLK1(Homo sapiens (Human))
Saarland University
Curated by ChEMBL
LigandPNGBDBM50026601(CHEMBL3335352)
Affinity DataIC50:  2.00E+3nM. Assay description: Inhibition of recombinant Clk1 (unknown origin) using GRSRSRSRSR peptide substrate
In DepthDetails ArticlePubMed
TargetDual specificity tyrosine-phosphorylation-regulated kinase 1A(Homo sapiens (Human))
Saarland University
Curated by ChEMBL
LigandPNGBDBM50026601(CHEMBL3335352)
Affinity DataIC50:  1.50E+4nM. Assay description: Inhibition of recombinant Dyrk1A (unknown origin) using KKISGRLSPIMTEQ-NH2 peptide substrate
In DepthDetails ArticlePubMed