BDBM50026824 CHEMBL3331519::US9669035, B-16
SMILES CCCOc1cncc(c1)-c1nnc2c(C)nc3ccc(CN4CCOCC4)cc3n12
InChI Key InChIKey=RXQBGBZOHKWYBQ-UHFFFAOYSA-N
Data  4 IC50
  Tab Delimited (TSV)   2D SDfile   Computed 3D by Vconf -m prep SDfile
Find this compound or compounds like it in BindingDB:
Activity Spreadsheet -- Enzyme Inhibition Constant Data from BindingDB
Found 4 hits for monomerid = 50026824
TargetcAMP and cAMP-inhibited cGMP 3',5'-cyclic phosphodiesterase 10A(Rattus norvegicus (rat))
Janssen Pharmaceutica
Curated by ChEMBL
LigandPNGBDBM50026824(CHEMBL3331519 | US9669035, B-16)
Affinity DataIC50:  6.13E+3nM. Assay description: Inhibition of rat PDE10A expressed in Sf9 cells incubated for 60 mins using [3H]-cAMP substrate by scintillation counting method
In DepthDetails ArticlePubMed
TargetcAMP and cAMP-inhibited cGMP 3',5'-cyclic phosphodiesterase 10A(Rattus norvegicus (rat))
Janssen Pharmaceutica
Curated by ChEMBL
LigandPNGBDBM50026824(CHEMBL3331519 | US9669035, B-16)
Affinity DataIC50:  6.20E+3nMpH: 7.8 T: 2°C. Assay description: Rat recombinant PDE10A (rPDE10A2) was expressed in Sf9 cells using a recombinant rPDE10A baculovirus construct. Cells were harvested after 48 h of in...
In DepthDetails US Patent
TargetcGMP-dependent 3',5'-cyclic phosphodiesterase(Homo sapiens (Human))
Janssen Pharmaceutica
US Patent
LigandPNGBDBM50026824(CHEMBL3331519 | US9669035, B-16)
Affinity DataIC50:  30nMpH: 7.8 T: 2°C. Assay description: Human recombinant PDE2A (hPDE2A) was expressed in Sf9 cells using a recombinant rPDE10A baculovirus construct. Cells were harvested after 48 h of inf...
In DepthDetails US Patent
TargetcGMP-dependent 3',5'-cyclic phosphodiesterase(Homo sapiens (Human))
Janssen Pharmaceutica
US Patent
LigandPNGBDBM50026824(CHEMBL3331519 | US9669035, B-16)
Affinity DataIC50:  31nM. Assay description: Inhibition of human PDE2A expressed in Sf9 cells incubated for 40 mins using [3H]-cGMP substrate by scintillation counting method
In DepthDetails ArticlePubMed