BDBM50027015 2-Piperazin-1-yl-nicotinonitrile::CHEMBL48137
SMILES N#Cc1cccnc1N1CCNCC1
InChI Key InChIKey=QSMNQUURWIAXAA-UHFFFAOYSA-N
Data  2 KI
PDB links: 1 PDB ID matches this monomer.
  Tab Delimited (TSV)   2D SDfile   Computed 3D by Vconf -m prep SDfile
Find this compound or compounds like it in BindingDB:
Activity Spreadsheet -- Enzyme Inhibition Constant Data from BindingDB
Found 2 hits for monomerid = 50027015
TargetAlpha-2A adrenergic receptor(BOVINE)
TBA
Curated by ChEMBL
LigandPNGBDBM50027015(2-Piperazin-1-yl-nicotinonitrile | CHEMBL48137)
Affinity DataKi:  14nM. Assay description: Binding activity against alpha-2 adrenergic receptor from calf cerebral cortex, using [3H]-clonidine as the radioligand
In DepthDetails ArticlePubMed
TargetAlpha-1A adrenergic receptor(CALF)
TBA
Curated by ChEMBL
LigandPNGBDBM50027015(2-Piperazin-1-yl-nicotinonitrile | CHEMBL48137)
Affinity DataKi:  2.00E+3nM. Assay description: Binding activity against alpha-1 adrenergic receptor from calf cerebral cortex, using [3H]-prazosin as the radioligand
In DepthDetails ArticlePubMed