BDBM50027181 CHEMBL3143785
SMILES CC(C)[Si](OC[C@H]1O[C@H](C[C@@H]1O)n1ccc(=O)[nH]c1=O)(C(C)C)C(C)C
InChI Key
Data  3 KI
  Tab Delimited (TSV)   2D SDfile   Computed 3D by Vconf -m prep SDfile
Find this compound or compounds like it in BindingDB:
Activity Spreadsheet -- Enzyme Inhibition Constant Data from BindingDB
Found 3 hits for monomerid = 50027181
TargetDeoxyuridine 5'-triphosphate nucleotidohydrolase(Plasmodium falciparum)
Cardiff University
Curated by ChEMBL
LigandPNGBDBM50027181(CHEMBL3143785)
Affinity DataKi:  2.27E+5nM. Assay description: Inhibitory constant against Plasmodium falciparum deoxyuridine 5'-triphosphate nucleotidohydrolase expressed in Escherichia coli BL21 (DE3) cells
In DepthDetails ArticlePubMed
TargetPutative deoxyuridine triphosphatase(Leishmania major)
Cardiff University
Curated by ChEMBL
LigandPNGBDBM50027181(CHEMBL3143785)
Affinity DataKi: >1.00E+6nM. Assay description: Inhibitory constant against Leishmania major deoxyuridine 5'-triphosphate nucleotidohydrolase
In DepthDetails ArticlePubMed
TargetDeoxyuridine 5'-triphosphate nucleotidohydrolase, mitochondrial(Homo sapiens (Human))
Cardiff University
Curated by ChEMBL
LigandPNGBDBM50027181(CHEMBL3143785)
Affinity DataKi: >1.00E+6nM. Assay description: Inhibitory constant against human deoxyuridine 5'-triphosphate nucleotidohydrolase expressed in Escherichia coli BL21 (DE3) cells
In DepthDetails ArticlePubMed