BDBM50027221 5-[4-(4-Bromo-phenyl)-4-hydroxy-piperidin-1-yl]-2,2-diphenyl-pentanenitrile::CHEMBL197749
SMILES OC1(CCN(CCCC(C#N)(c2ccccc2)c2ccccc2)CC1)c1ccc(Br)cc1
InChI Key InChIKey=JAUZNKYWTNLAFX-UHFFFAOYSA-N
Data  1 IC50
  Tab Delimited (TSV)   2D SDfile   Computed 3D by Vconf -m prep SDfile
Find this compound or compounds like it in BindingDB:
Activity Spreadsheet -- Enzyme Inhibition Constant Data from BindingDB
Found 1 hit for monomerid = 50027221
TargetG-protein coupled receptor homolog US28(Human cytomegalovirus (strain AD169) (HHV-5) (Huma...)
Vrije Universiteit
Curated by PDSP Ki Database
LigandPNGBDBM50027221(5-[4-(4-Bromo-phenyl)-4-hydroxy-piperidin-1-yl]-2,...)
Affinity DataIC50:  1.95E+4nM. Assay description: Inhibitory concentration against chemokine receptor US28 expressed in COS-7 cells using [125I]-CCL5
In DepthDetails ArticlePubMed