BDBM50027571 CHEMBL92372::sodium 2,3-dihydro-1H-inden-5-yl methoxycarbonylphosphonate
SMILES COC(=O)P([O-])(=O)Oc1ccc2CCCc2c1
InChI Key InChIKey=QPMGKEAXZZUEFI-UHFFFAOYSA-M
Data  1 IC50
  Tab Delimited (TSV)   2D SDfile   Computed 3D by Vconf -m prep SDfile
Find this compound or compounds like it in BindingDB:
Activity Spreadsheet -- Enzyme Inhibition Constant Data from BindingDB
Found 1 hit for monomerid = 50027571
TargetDNA polymerase catalytic subunit(Human herpesvirus 1 (strain 17) (HHV-1) (Human her...)
TBA
Curated by ChEMBL
LigandPNGBDBM50027571(CHEMBL92372 | sodium 2,3-dihydro-1H-inden-5-yl met...)
Affinity DataIC50: >5.00E+5nM. Assay description: Inhibition of HSV-1 DNA polymerase in HSV-1 C42 plaque reduction assay
In DepthDetails ArticlePubMed