BDBM50027684 CHEMBL3344404
SMILES COc1cc(OC)cc(\C=C\c2cccc3n(CCCOS(=O)(=O)c4ccc(C)cc4)ccc23)c1
InChI Key InChIKey=RSTCRUIYHKRMAK-ZHACJKMWSA-N
Data  1 KI  1 IC50
  Tab Delimited (TSV)   2D SDfile   Computed 3D by Vconf -m prep SDfile
Find this compound or compounds like it in BindingDB:
Activity Spreadsheet -- Enzyme Inhibition Constant Data from BindingDB
Found 2 hits for monomerid = 50027684
Target1,25-dihydroxyvitamin D(3) 24-hydroxylase, mitochondrial(Homo sapiens (Human))
Cardiff University
Curated by ChEMBL
LigandPNGBDBM50027684(CHEMBL3344404)
Affinity DataKi:  1.19E+3nM. Assay description: Inhibition of N-terminally MBP-fused human CYP24A1 by cell-free assay
In DepthDetails ArticlePubMed
Target1,25-dihydroxyvitamin D(3) 24-hydroxylase, mitochondrial(Homo sapiens (Human))
Cardiff University
Curated by ChEMBL
LigandPNGBDBM50027684(CHEMBL3344404)
Affinity DataIC50:  1.69E+4nM. Assay description: Inhibition of N-terminally MBP-fused human CYP24A1 by cell-free assay
In DepthDetails ArticlePubMed