BDBM50027696 CHEMBL23379::[(2,3-Dihydro-benzo[1,4]dioxin-6-yl)-(3-mercapto-2-methyl-propionyl)-amino]-acetic acid
SMILES CC(CS)C(=O)N(CC(O)=O)c1ccc2OCCOc2c1
InChI Key InChIKey=HOPMCKFIIRULEW-UHFFFAOYSA-N
Data  1 IC50
  Tab Delimited (TSV)   2D SDfile   Computed 3D by Vconf -m prep SDfile
Find this compound or compounds like it in BindingDB:
Activity Spreadsheet -- Enzyme Inhibition Constant Data from BindingDB
Found 1 hit for monomerid = 50027696
TargetAngiotensin-converting enzyme(Oryctolagus cuniculus)
TBA
Curated by ChEMBL
LigandPNGBDBM50027696(CHEMBL23379 | [(2,3-Dihydro-benzo[1,4]dioxin-6-yl)...)
Affinity DataIC50:  10nM. Assay description: In vitro inhibition of Angiotensin I converting enzyme
In DepthDetails ArticlePubMed