BDBM50027783 2-Ethynyl Naphtalene::CHEMBL1743361
SMILES C#Cc1ccc2ccccc2c1
InChI Key InChIKey=IZXPFTLEVNQLGD-UHFFFAOYSA-N
Data  1 KI  1 IC50
  Tab Delimited (TSV)   2D SDfile   Computed 3D by Vconf -m prep SDfile
Find this compound or compounds like it in BindingDB:
Activity Spreadsheet -- Enzyme Inhibition Constant Data from BindingDB
Found 2 hits for monomerid = 50027783
TargetCytochrome P450 2B1(Rattus norvegicus)
F. Hoffmann-La Roche
Curated by ChEMBL
LigandPNGBDBM50027783(2-Ethynyl Naphtalene | CHEMBL1743361)
Affinity DataKi:  80nM. Assay description: Mechanism based inhibition of rat cytochrome P450 CYP2B1 measured by 7-ethoxycoumarin O-deethylase activity
In DepthDetails ArticlePubMed
TargetUDP-N-acetylglucosamine--peptide N-acetylglucosaminyltransferase 110 kDa subunit(Homo sapiens (Human))
University Of Chinese Academy Of Sciences
Curated by ChEMBL
LigandPNGBDBM50027783(2-Ethynyl Naphtalene | CHEMBL1743361)
Affinity DataIC50: >4.00E+6nM. Assay description: Inhibition of OGT (unknown origin) assessed as reduction in GlcNAc transfer to CKII peptide incubated for 60 mins by HPLC method
In DepthDetails ArticlePubMed