BDBM50027812 CHEMBL155072
SMILES C[C@H](CNc1ccccc1)NC[C@H](O)c1cccc(Cl)c1
InChI Key InChIKey=IUDHYTDAODRVLB-DYVFJYSZSA-N
Data  3 EC50
  Tab Delimited (TSV)   2D SDfile   Computed 3D by Vconf -m prep SDfile
Find this compound or compounds like it in BindingDB:
Activity Spreadsheet -- Enzyme Inhibition Constant Data from BindingDB
Found 3 hits for monomerid = 50027812
TargetBeta-2 adrenergic receptor(Homo sapiens (Human))
Glaxosmithkline
Curated by ChEMBL
LigandPNGBDBM50027812(CHEMBL155072)
Affinity DataEC50:  10nM. Assay description: Ability to cause cAMP accumulation in CHO cells expressing human beta-2 AR expressed as the negative logarithm of the molar drug concentration
In DepthDetails ArticlePubMed
TargetBeta-1 adrenergic receptor(Homo sapiens (Human))
Glaxosmithkline
Curated by ChEMBL
LigandPNGBDBM50027812(CHEMBL155072)
Affinity DataEC50:  5nM. Assay description: Ability to cause cAMP accumulation in CHO cells expressing human beta-1 AR expressed as the negative logarithm of the molar drug concentration
In DepthDetails ArticlePubMed
TargetBeta-3 adrenergic receptor(Homo sapiens (Human))
Glaxosmithkline
Curated by ChEMBL
LigandPNGBDBM50027812(CHEMBL155072)
Affinity DataEC50:  20nM. Assay description: Ability to cause cAMP accumulation in CHO cells expressing human beta-3 AR expressed as the negative logarithm of the molar drug concentration
In DepthDetails ArticlePubMed