BDBM50027857 CHEMBL2323550
SMILES [H][C@@]1(CC[C@@]2([H])[C@]3([H])CC[C@]4([H])C[C@H](O)CC[C@]4(C)[C@@]3([H])CC[C@]12C)[C@H](C)CCC(=O)N[C@@H](CC(O)=O)C(O)=O
InChI Key InChIKey=KCGMIQQXZFFRLL-CNZWOIIDSA-N
Data  1 IC50
  Tab Delimited (TSV)   2D SDfile   Computed 3D by Vconf -m prep SDfile
Find this compound or compounds like it in BindingDB:
Activity Spreadsheet -- Enzyme Inhibition Constant Data from BindingDB
Found 1 hit for monomerid = 50027857
TargetEphrin type-A receptor 2(Homo sapiens (Human))
Universit£
Curated by ChEMBL
LigandPNGBDBM50027857(CHEMBL2323550)
Affinity DataIC50: <3.16E+5nM. Assay description: Inhibition of ephrin-A1-Fc binding to EphA2-Fc receptor (unknown origin) after 1 hr by ELISA
In DepthDetails ArticlePubMed