BDBM50028006 CHEMBL186268
SMILES CC(C)(C)c1ccc(cc1)S(=O)(=O)Nc1ccccc1O
InChI Key InChIKey=LBLDWCORBVGHIL-UHFFFAOYSA-N
Data  2 IC50
  Tab Delimited (TSV)   2D SDfile   Computed 3D by Vconf -m prep SDfile
Find this compound or compounds like it in BindingDB:
Activity Spreadsheet -- Enzyme Inhibition Constant Data from BindingDB
Found 2 hits for monomerid = 50028006
Target17-beta-hydroxysteroid dehydrogenase type 2(Homo sapiens (Human))
University Of Innsbruck
Curated by ChEMBL
LigandPNGBDBM50028006(CHEMBL186268)
Affinity DataIC50:  1.23E+3nM. Assay description: Inhibition of recombinant human 17beta-HSD2 expressed in HEK293 cells using estradiol as substrate after 10 mins in presence of radiolabeled tracer s...
In DepthDetails ArticlePubMed
TargetCytochrome b-c1 complex subunit 7(Homo sapiens (Human))
Yonsei University
Curated by ChEMBL
LigandPNGBDBM50028006(CHEMBL186268)
Affinity DataIC50:  8.00E+3nM. Assay description: Modulation of UQCRB in human HepG2 cells assessed as inhibition of HIF-1alpha for 4 hrs under 1%O2 by Western blot analysis
In DepthDetails ArticlePubMed