BDBM50028193 5-Fluoro-pent-2-ene-1,4-diamine::CHEMBL288059
SMILES NC\C=C\C(N)CF
InChI Key InChIKey=WHCJZNLLRJRMHI-OWOJBTEDSA-N
Data  1 KI
  Tab Delimited (TSV)   2D SDfile   Computed 3D by Vconf -m prep SDfile
Find this compound or compounds like it in BindingDB:
Activity Spreadsheet -- Enzyme Inhibition Constant Data from BindingDB
Found 1 hit for monomerid = 50028193
TargetOrnithine decarboxylase(Rattus norvegicus)
TBA
Curated by ChEMBL
LigandPNGBDBM50028193(5-Fluoro-pent-2-ene-1,4-diamine | CHEMBL288059)
Affinity DataKi:  4.20E+4nM. Assay description: The apparent dissociation constant for irreversible inhibition of rat liver ornithine decarboxylase (ODC)
In DepthDetails ArticlePubMed