BDBM50028194 5,5-Difluoro-pentane-1,4-diamine::CHEMBL39264
SMILES NCCCC(N)C(F)F
InChI Key InChIKey=PUAMHXQPUKPWSJ-UHFFFAOYSA-N
Data  1 KI
  Tab Delimited (TSV)   2D SDfile   Computed 3D by Vconf -m prep SDfile
Find this compound or compounds like it in BindingDB:
Activity Spreadsheet -- Enzyme Inhibition Constant Data from BindingDB
Found 1 hit for monomerid = 50028194
TargetOrnithine decarboxylase(Rattus norvegicus)
TBA
Curated by ChEMBL
LigandPNGBDBM50028194(5,5-Difluoro-pentane-1,4-diamine | CHEMBL39264)
Affinity DataKi:  3.00E+4nM. Assay description: The apparent dissociation constant for irreversible inhibition of rat liver ornithine decarboxylase (ODC)
In DepthDetails ArticlePubMed