BDBM50028438 CHEMBL3355120
SMILES C[C@H]1N2C(COc3cc(c(cc23)C2CCN(C)C2)-c2ccccc2F)=NNC1=O
InChI Key InChIKey=RVEGZHVWGSUYNT-KWCCSABGSA-N
Data  1 IC50
  Tab Delimited (TSV)   2D SDfile   Computed 3D by Vconf -m prep SDfile
Find this compound or compounds like it in BindingDB:
Activity Spreadsheet -- Enzyme Inhibition Constant Data from BindingDB
Found 1 hit for monomerid = 50028438
TargetProtein kinase C theta type(Homo sapiens (Human))
Abbvie Bioresearch Center
Curated by ChEMBL
LigandPNGBDBM50028438(CHEMBL3355120)
Affinity DataIC50:  42nM. Assay description: Inhibition of human recombinant PKCtheta expressed in Sf21 cells using Bio-cdc peptide substrate and ATP after 60 mins by time-resolved fluorescence ...
In DepthDetails ArticlePubMed