BDBM50028517 CHEMBL3342479
SMILES CCC(CC)O[C@@H]1C=C(C[C@H](NCCCc2ccccc2)[C@H]1NC(C)=O)C(O)=O
InChI Key InChIKey=XSHYAKVACIHYRB-BHDDXSALSA-N
Data  4 IC50
  Tab Delimited (TSV)   2D SDfile   Computed 3D by Vconf -m prep SDfile
Find this compound or compounds like it in BindingDB:
Activity Spreadsheet -- Enzyme Inhibition Constant Data from BindingDB
Found 4 hits for monomerid = 50028517
TargetNeuraminidase(Influenza A virus)
Shandong University
Curated by ChEMBL
LigandPNGBDBM50028517(CHEMBL3342479)
Affinity DataIC50:  32nM. Assay description: Inhibition of Influenza A virus A/chicken/china/1220/2012(H5N1) Neuraminidase N1
In DepthDetails ArticlePubMed
TargetNeuraminidase(Influenza A virus (strain A/USSR/90/1977 H1N1))
Shandong University
Curated by ChEMBL
LigandPNGBDBM50028517(CHEMBL3342479)
Affinity DataIC50: >5.00E+3nM. Assay description: Inhibition of Influenza A virus A/chicken/shandong/S2/02(H9N2) Neuraminidase
In DepthDetails ArticlePubMed
TargetNeuraminidase(Influenza A virus (strain A/USSR/90/1977 H1N1))
Shandong University
Curated by ChEMBL
LigandPNGBDBM50028517(CHEMBL3342479)
Affinity DataIC50:  190nM. Assay description: Inhibition of Influenza A virus A/duck/china/QJ/01(H5N1) Neuraminidase
In DepthDetails ArticlePubMed
TargetNeuraminidase(Influenza A virus (strain A/USSR/90/1977 H1N1))
Shandong University
Curated by ChEMBL
LigandPNGBDBM50028517(CHEMBL3342479)
Affinity DataIC50:  81nM. Assay description: Inhibition of Influenza A virus A/duck/china/1206/2012(H5N1) Neuraminidase
In DepthDetails ArticlePubMed