BDBM50028573 CHEMBL3338951
SMILES Oc1ccccc1OCc1nn2c(nnc2s1)-c1cccnc1
InChI Key InChIKey=UILHNFLPZDUQIY-UHFFFAOYSA-N
Data  2 IC50
  Tab Delimited (TSV)   2D SDfile   Computed 3D by Vconf -m prep SDfile
Find this compound or compounds like it in BindingDB:
Activity Spreadsheet -- Enzyme Inhibition Constant Data from BindingDB
Found 2 hits for monomerid = 50028573
TargetAcetylcholinesterase(Electrophorus electricus (Electric eel))
Quaid-I-Azam University
Curated by ChEMBL
LigandPNGBDBM50028573(CHEMBL3338951)
Affinity DataIC50:  3.55E+4nM. Assay description: Inhibition of electric eel AChE by Ellman's method
In DepthDetails ArticlePubMed
TargetCholinesterase(Homo sapiens (Human))
Quaid-I-Azam University
Curated by ChEMBL
LigandPNGBDBM50028573(CHEMBL3338951)
Affinity DataIC50:  3.02E+3nM. Assay description: Inhibition of human BChE by Ellman's method
In DepthDetails ArticlePubMed