BDBM50028587 1-(4-Ethylsulfanyl-5-hydroxymethyl-tetrahydro-furan-2-yl)-5-methyl-1H-pyrimidine-2,4-dione::CHEMBL22539
SMILES CCSC1CC(OC1CO)n1cc(C)c(=O)[nH]c1=O
InChI Key InChIKey=ZWPXGLDYWMZUND-UHFFFAOYSA-N
Data  2 KI
  Tab Delimited (TSV)   2D SDfile   Computed 3D by Vconf -m prep SDfile
Find this compound or compounds like it in BindingDB:
Activity Spreadsheet -- Enzyme Inhibition Constant Data from BindingDB
Found 2 hits for monomerid = 50028587
TargetThymidine kinase, cytosolic(Rattus norvegicus)
TBA
Curated by ChEMBL
LigandPNGBDBM50028587(1-(4-Ethylsulfanyl-5-hydroxymethyl-tetrahydro-fura...)
Affinity DataKi:  2.40E+4nM. Assay description: Competitive inhibition against rat cytoplasmic Thymidine kinase
In DepthDetails ArticlePubMed
TargetThymidine kinase 2, mitochondrial (Predicted)(Rattus norvegicus)
TBA
Curated by ChEMBL
LigandPNGBDBM50028587(1-(4-Ethylsulfanyl-5-hydroxymethyl-tetrahydro-fura...)
Affinity DataKi:  6.20E+4nM. Assay description: Competitive inhibition against rat mitochondrial thymidine kinase
In DepthDetails ArticlePubMed