BDBM50028699 CHEMBL3342677
SMILES NC(=N)NCCC[C@H](NC(=O)CCCC(c1ccccc1)c1ccccc1)C(O)=O
InChI Key InChIKey=TVFIUFWZBUOQNV-FQEVSTJZSA-N
Data  4 IC50
  Tab Delimited (TSV)   2D SDfile   Computed 3D by Vconf -m prep SDfile
Find this compound or compounds like it in BindingDB:
Activity Spreadsheet -- Enzyme Inhibition Constant Data from BindingDB
Found 4 hits for monomerid = 50028699
TargetC3a anaphylatoxin chemotactic receptor(Homo sapiens (Human))
The University Of Queensland
Curated by ChEMBL
LigandPNGBDBM50028699(CHEMBL3342677)
Affinity DataIC50:  6.31E+3nM. Assay description: Antagonist activity against C3AR in HMDMs assessed as inhibition of C3a-induced intracellular calcium release by Fluo-3 AM dye based FLIPR assay
In DepthDetails ArticlePubMed
TargetC3a anaphylatoxin chemotactic receptor(Homo sapiens (Human))
The University Of Queensland
Curated by ChEMBL
LigandPNGBDBM50028699(CHEMBL3342677)
Affinity DataIC50:  96nM. Assay description: Displacement of [125I]-C3a from C3AR in HMDMs by scintillation counting method
In DepthDetails ArticlePubMed
TargetC3a anaphylatoxin chemotactic receptor(Homo sapiens (Human))
The University Of Queensland
Curated by ChEMBL
LigandPNGBDBM50028699(CHEMBL3342677)
Affinity DataIC50:  100nM. Assay description: Displacement of [125I]-C3a from C3AR in HMDMs by scintillation counting method
In DepthDetails ArticlePubMed
TargetC3a anaphylatoxin chemotactic receptor(Homo sapiens (Human))
The University Of Queensland
Curated by ChEMBL
LigandPNGBDBM50028699(CHEMBL3342677)
Affinity DataIC50:  6.30E+3nM. Assay description: Antagonist activity against C3AR in HMDMs assessed as inhibition of C3a-induced intracellular calcium release by Fluo-3 AM dye based FLIPR assay
In DepthDetails ArticlePubMed