BDBM50029093 CHEMBL3343303
SMILES Nc1c(OCCCO)cccc1OCc1cc(on1)-c1ccc(Cl)s1
InChI Key InChIKey=VDLIHPNLMSFXEE-UHFFFAOYSA-N
Data  2 KI
  Tab Delimited (TSV)   2D SDfile   Computed 3D by Vconf -m prep SDfile
Find this compound or compounds like it in BindingDB:
Activity Spreadsheet -- Enzyme Inhibition Constant Data from BindingDB
Found 2 hits for monomerid = 50029093
TargetCoagulation factor X(Homo sapiens (Human))
Consiglio Nazionale Delle Ricerche
Curated by ChEMBL
LigandPNGBDBM50029093(CHEMBL3343303)
Affinity DataKi:  1.83E+4nM. Assay description: Inhibition of human factor10a assessed as reduction in hydrolysis of chromogenic substrate S-2765 by Cheng-Prusoff equation analysis
In DepthDetails ArticlePubMed
TargetProthrombin(Bos taurus (Bovine))
Consiglio Nazionale Delle Ricerche
Curated by ChEMBL
LigandPNGBDBM50029093(CHEMBL3343303)
Affinity DataKi:  2.98E+4nM. Assay description: Inhibition of bovine thrombin assessed as reduction in hydrolysis of chromogenic substrate S-2238 by Cheng-Prusoff equation analysis
In DepthDetails ArticlePubMed