BDBM50029101 5,6,7,8-Tetrachloro-1,2,3,4-tetrahydro-isoquinoline::CHEMBL149816
SMILES Clc1c(Cl)c(Cl)c2CNCCc2c1Cl
InChI Key InChIKey=BUKGFYLSZBAHLX-UHFFFAOYSA-N
Data  1 KI  1 IC50
  Tab Delimited (TSV)   2D SDfile   Computed 3D by Vconf -m prep SDfile
Find this compound or compounds like it in BindingDB:
Activity Spreadsheet -- Enzyme Inhibition Constant Data from BindingDB
Found 2 hits for monomerid = 50029101
TargetPhenylethanolamine N-methyltransferase(Homo sapiens (Human))
TBA
Curated by ChEMBL
LigandPNGBDBM50029101(5,6,7,8-Tetrachloro-1,2,3,4-tetrahydro-isoquinolin...)
Affinity DataKi:  52nM. Assay description: Dissociation constant(Ki) of compound was determined to measure Phenylethanolamine N-methyltransferase inhibitory potency
In DepthDetails ArticlePubMed
TargetPhenylethanolamine N-methyltransferase(Homo sapiens (Human))
TBA
Curated by ChEMBL
LigandPNGBDBM50029101(5,6,7,8-Tetrachloro-1,2,3,4-tetrahydro-isoquinolin...)
Affinity DataIC50:  200nM. Assay description: In vitro inhibitory potency of the compound was measured against phenylethanolamine N-methyltransferase
In DepthDetails ArticlePubMed