BDBM50029229 2-Methyl-2-pyridin-3-yl-propionic acid adamantan-1-yl ester::CHEMBL134169
SMILES CC(C)(C(=O)OC12CC3CC(CC(C3)C1)C2)c1cccnc1
InChI Key InChIKey=UCAOECOTTLTKLR-UHFFFAOYSA-N
Data  3 IC50
  Tab Delimited (TSV)   2D SDfile   Computed 3D by Vconf -m prep SDfile
Find this compound or compounds like it in BindingDB:
Activity Spreadsheet -- Enzyme Inhibition Constant Data from BindingDB
Found 3 hits for monomerid = 50029229
TargetAromatase(Homo sapiens (Human))
Crc Laboratory
Curated by ChEMBL
LigandPNGBDBM50029229(2-Methyl-2-pyridin-3-yl-propionic acid adamantan-1...)
Affinity DataIC50:  3.50E+4nM. Assay description: Tested for inhibition of human placental Cytochrome P450 19A1
In DepthDetails ArticlePubMed
TargetSteroid 17-alpha-hydroxylase/17,20 lyase(Homo sapiens (Human))
Crc Laboratory
Curated by ChEMBL
LigandPNGBDBM50029229(2-Methyl-2-pyridin-3-yl-propionic acid adamantan-1...)
Affinity DataIC50:  13nM. Assay description: Tested for inhibition of human testicular C17,20-Lyase.
In DepthDetails ArticlePubMed
TargetSteroid 17-alpha-hydroxylase/17,20 lyase(Homo sapiens (Human))
Crc Laboratory
Curated by ChEMBL
LigandPNGBDBM50029229(2-Methyl-2-pyridin-3-yl-propionic acid adamantan-1...)
Affinity DataIC50:  13nM. Assay description: Tested for inhibition of human testicular C17,20-Lyase.
In DepthDetails ArticlePubMed