BDBM50029265 1-{6-[4-(2-Isopropoxy-phenyl)-piperazin-1-ylmethyl]-pyridin-2-ylmethyl}-piperidin-2-one; hydrochloride::CHEMBL553555
SMILES CC(C)Oc1ccccc1N1CCN(Cc2cccc(CN3CCCCC3=O)n2)CC1
InChI Key InChIKey=PLVXGHMFJNEQRI-UHFFFAOYSA-N
Data  2 KI
  Tab Delimited (TSV)   2D SDfile   Computed 3D by Vconf -m prep SDfile
Find this compound or compounds like it in BindingDB:
Activity Spreadsheet -- Enzyme Inhibition Constant Data from BindingDB
Found 2 hits for monomerid = 50029265
Target5-hydroxytryptamine receptor 1A(Rattus norvegicus (rat))
R. W. Johnson Pharmaceutical Research Institute
Curated by ChEMBL
LigandPNGBDBM50029265(1-{6-[4-(2-Isopropoxy-phenyl)-piperazin-1-ylmethyl...)
Affinity DataKi:  829nM. Assay description: Binding affinity was determined against 5-hydroxytryptamine 1A receptor using [3H]WB-4101
In DepthDetails ArticlePubMed
TargetD(2) dopamine receptor(Rattus norvegicus (rat))
R. W. Johnson Pharmaceutical Research Institute
Curated by ChEMBL
LigandPNGBDBM50029265(1-{6-[4-(2-Isopropoxy-phenyl)-piperazin-1-ylmethyl...)
Affinity DataKi:  2.42E+3nM. Assay description: Binding affinity was determined against Dopamine receptor D2 using [3H]spiperone
In DepthDetails ArticlePubMed