BDBM50029378 4-[6-Chloro-3-(4-fluoro-phenyl)-indan-1-yl]-1,2,2-trimethyl-piperazine::CHEMBL136630
SMILES CN1CCN(CC1(C)C)C1CC(c2ccc(Cl)cc12)c1ccc(F)cc1
InChI Key InChIKey=PUQPKVFFZKBJLD-UHFFFAOYSA-N
Data  6 IC50
  Tab Delimited (TSV)   2D SDfile   Computed 3D by Vconf -m prep SDfile
Find this compound or compounds like it in BindingDB:
Activity Spreadsheet -- Enzyme Inhibition Constant Data from BindingDB
Found 6 hits for monomerid = 50029378
Target5-hydroxytryptamine receptor 2A(Rattus norvegicus (rat))
H. Lundbeck
Curated by ChEMBL
LigandPNGBDBM50029378(4-[6-Chloro-3-(4-fluoro-phenyl)-indan-1-yl]-1,2,2-...)
Affinity DataIC50:  1.10nM. Assay description: Binding affinity for 5-hydroxytryptamine 2A receptor, activity is expressed as IC50 values.
In DepthDetails ArticlePubMed
TargetD(2) dopamine receptor(Rattus norvegicus (rat))
H. Lundbeck
Curated by ChEMBL
LigandPNGBDBM50029378(4-[6-Chloro-3-(4-fluoro-phenyl)-indan-1-yl]-1,2,2-...)
Affinity DataIC50:  5nM. Assay description: Binding affinity against dopamine receptor D2
In DepthDetails ArticlePubMed
Target5-hydroxytryptamine receptor 2A(Rattus norvegicus (rat))
H. Lundbeck
Curated by ChEMBL
LigandPNGBDBM50029378(4-[6-Chloro-3-(4-fluoro-phenyl)-indan-1-yl]-1,2,2-...)
Affinity DataIC50:  1.10nM. Assay description: Binding affinity for 5-hydroxytryptamine 2A receptor, activity is expressed as IC50 values.
In DepthDetails ArticlePubMed
TargetD(1A) dopamine receptor(RAT)
H. Lundbeck
Curated by ChEMBL
LigandPNGBDBM50029378(4-[6-Chloro-3-(4-fluoro-phenyl)-indan-1-yl]-1,2,2-...)
Affinity DataIC50:  0.680nM. Assay description: Binding affinity for dopamine receptor D1, activity is expressed as IC50 values.
In DepthDetails ArticlePubMed
TargetD(2) dopamine receptor(Rattus norvegicus (rat))
H. Lundbeck
Curated by ChEMBL
LigandPNGBDBM50029378(4-[6-Chloro-3-(4-fluoro-phenyl)-indan-1-yl]-1,2,2-...)
Affinity DataIC50:  5nM. Assay description: Binding affinity against dopamine receptor D2
In DepthDetails ArticlePubMed
TargetD(1A) dopamine receptor(RAT)
H. Lundbeck
Curated by ChEMBL
LigandPNGBDBM50029378(4-[6-Chloro-3-(4-fluoro-phenyl)-indan-1-yl]-1,2,2-...)
Affinity DataIC50:  1.30nM. Assay description: Binding affinity for dopamine receptor D1, activity is expressed as IC50 values.
In DepthDetails ArticlePubMed