BDBM50029470 CHEMBL3343447
SMILES Cc1cc(Cc2cccc(F)c2)n(O)c(=O)c1
InChI Key InChIKey=PSXPUUILDSBWEJ-UHFFFAOYSA-N
Data  1 KI
  Tab Delimited (TSV)   2D SDfile   Computed 3D by Vconf -m prep SDfile
Find this compound or compounds like it in BindingDB:
Activity Spreadsheet -- Enzyme Inhibition Constant Data from BindingDB
Found 1 hit for monomerid = 50029470
TargetIsocitrate dehydrogenase [NADP] cytoplasmic(Homo sapiens (Human))
Baylor College Of Medicine
Curated by ChEMBL
LigandPNGBDBM50029470(CHEMBL3343447)
Affinity DataKi:  2.20E+3nM. Assay description: Inhibition of human IDH1 R132H mutant expressed in Escherichia coli BL21-CodonPlus assessed as reduction in NADPH consumption
In DepthDetails ArticlePubMed