BDBM50029554 CHEMBL3343469
SMILES Cc1cc(Cc2ccccc2)oc(=O)c1
InChI Key InChIKey=WFYCCNGMMNQOLT-UHFFFAOYSA-N
Data  1 KI
  Tab Delimited (TSV)   2D SDfile   Computed 3D by Vconf -m prep SDfile
Find this compound or compounds like it in BindingDB:
Activity Spreadsheet -- Enzyme Inhibition Constant Data from BindingDB
Found 1 hit for monomerid = 50029554
TargetIsocitrate dehydrogenase [NADP] cytoplasmic(Homo sapiens (Human))
Baylor College Of Medicine
Curated by ChEMBL
LigandPNGBDBM50029554(CHEMBL3343469)
Affinity DataKi: >5.00E+4nM. Assay description: Inhibition of human IDH1 R132H mutant expressed in Escherichia coli BL21-CodonPlus assessed as reduction in NADPH consumption
In DepthDetails ArticlePubMed