BDBM50029573 2-[1-(4-Chloro-benzyl)-4-methyl-6-(5-phenyl-pyridin-2-ylmethoxy)-4,5-dihydro-1H-thiopyrano[2,3,4-cd]indol-2-ylmethylsulfanyl]-benzoic acid::CHEMBL342680
SMILES CC1Cc2c(OCc3ccc(cn3)-c3ccccc3)ccc3n(Cc4ccc(Cl)cc4)c(CSc4ccccc4C(O)=O)c(S1)c23
InChI Key InChIKey=NMVZMWYBCUPLBD-UHFFFAOYSA-N
Data  1 IC50
  Tab Delimited (TSV)   2D SDfile   Computed 3D by Vconf -m prep SDfile
Find this compound or compounds like it in BindingDB:
Activity Spreadsheet -- Enzyme Inhibition Constant Data from BindingDB
Found 1 hit for monomerid = 50029573
TargetPolyunsaturated fatty acid 5-lipoxygenase(Homo sapiens (Human))
Merck Frosst Centre For Therapeutic Research
Curated by ChEMBL
LigandPNGBDBM50029573(2-[1-(4-Chloro-benzyl)-4-methyl-6-(5-phenyl-pyridi...)
Affinity DataIC50:  30nM. Assay description: Inhibition of Human 5-lipoxygenase
In DepthDetails ArticlePubMed