BDBM50029949 5,6-Dimethoxy-2-piperidin-4-ylmethyl-indan-1-one; hydrochloride::CHEMBL339630::CHEMBL554887
SMILES COc1cc2CC(CC3CCNCC3)C(=O)c2cc1OC
InChI Key InChIKey=PGBZORAISITZTF-UHFFFAOYSA-N
Data  3 IC50
  Tab Delimited (TSV)   2D SDfile   Computed 3D by Vconf -m prep SDfile
Find this compound or compounds like it in BindingDB:
Activity Spreadsheet -- Enzyme Inhibition Constant Data from BindingDB
Found 3 hits for monomerid = 50029949
TargetAcetylcholinesterase(Mus musculus (mouse))
TBA
Curated by ChEMBL
LigandPNGBDBM50029949(5,6-Dimethoxy-2-piperidin-4-ylmethyl-indan-1-one; ...)
Affinity DataIC50:  5.40E+3nM. Assay description: Inhibition of Acetylcholinesterase activity in mouse brain homogenate
In DepthDetails Article
TargetAcetylcholinesterase(Mus musculus (mouse))
TBA
Curated by ChEMBL
LigandPNGBDBM50029949(5,6-Dimethoxy-2-piperidin-4-ylmethyl-indan-1-one; ...)
Affinity DataIC50:  5.40E+3nM. Assay description: Inhibition against Acetylcholinesterase (AChE)
In DepthDetails ArticlePubMed
TargetAcetylcholinesterase(Mus musculus (mouse))
TBA
Curated by ChEMBL
LigandPNGBDBM50029949(5,6-Dimethoxy-2-piperidin-4-ylmethyl-indan-1-one; ...)
Affinity DataIC50:  5.40E+3nM. Assay description: Inhibitory activity against acetylcholinesterase
In DepthDetails ArticlePubMed