BDBM50030062 Ac-(D-Pen)-I-P-R-G-D-(Y-OMe)-R-C-NH2::CHEMBL438460
SMILES CC[C@H](C)[C@H]1NC(=O)[C@H](NC(C)=O)C(C)(C)SSC[C@@H](NC(=O)[C@@H](CCCNC(N)=N)NC(=O)[C@H](Cc2ccc(OC)cc2)NC(=O)[C@@H](CC(O)=O)NC(=O)CNC(=O)[C@@H](CCCNC(N)=N)NC(=O)[C@@H]2CCCN2C1=O)C(N)=O
InChI Key InChIKey=JWDZKECSZGMGRE-SJEUTWRPSA-N
Data  3 IC50
  Tab Delimited (TSV)   2D SDfile   Computed 3D by Vconf -m prep SDfile
Find this compound or compounds like it in BindingDB:
Activity Spreadsheet -- Enzyme Inhibition Constant Data from BindingDB
Found 3 hits for monomerid = 50030062
TargetIntegrin alpha-V/beta-5(Homo sapiens (Human))
Telios Pharmaceuticals
Curated by ChEMBL
LigandPNGBDBM50030062(Ac-(D-Pen)-I-P-R-G-D-(Y-OMe)-R-C-NH2 | CHEMBL43846...)
Affinity DataIC50:  4.30E+3nM. Assay description: Binding affinity against integrin alpha V-beta5 in enzyme linked immunosorbent assay (ELISA)
In DepthDetails ArticlePubMed
TargetIntegrin alpha-IIb/beta-3(Homo sapiens (Human))
Telios Pharmaceuticals
Curated by ChEMBL
LigandPNGBDBM50030062(Ac-(D-Pen)-I-P-R-G-D-(Y-OMe)-R-C-NH2 | CHEMBL43846...)
Affinity DataIC50:  2nM. Assay description: Binding affinity against integrin alpha 2b-beta 3 in enzyme linked immunosorbent assay (ELISA)
In DepthDetails ArticlePubMed
TargetIntegrin alpha-5/beta-1(Homo sapiens (Human))
Telios Pharmaceuticals
Curated by ChEMBL
LigandPNGBDBM50030062(Ac-(D-Pen)-I-P-R-G-D-(Y-OMe)-R-C-NH2 | CHEMBL43846...)
Affinity DataIC50:  4.30E+3nM. Assay description: Binding affinity against integrin alpha5-beta1 in enzyme linked immunosorbent assay (ELISA)
In DepthDetails ArticlePubMed