BDBM50030266 CHEMBL3339223::US9603889, Example 8
SMILES CN[C@@H](C)C(=O)N[C@H](C(=O)N1C[C@H](C[C@H]1C(=O)N[C@@H]1CCCc2ccccc12)NC(=O)c1ccc(CN([C@@H](COC)c2ccccc2)C(=O)[C@@H]2Cc3ccccc3CN2C(=O)[C@@H](NC(=O)[C@H](C)NC)C(C)(C)C)cc1)C(C)(C)C
InChI Key InChIKey=XZWQAFLMOTZHHO-DFNGJWONSA-N
Data  4 IC50
  Tab Delimited (TSV)   2D SDfile   Computed 3D by Vconf -m prep SDfile
Find this compound or compounds like it in BindingDB:
Activity Spreadsheet -- Enzyme Inhibition Constant Data from BindingDB
Found 4 hits for monomerid = 50030266
TargetE3 ubiquitin-protein ligase XIAP(Homo sapiens (Human))
Bristol-Myers Squibb Research & Development
Curated by ChEMBL
LigandPNGBDBM50030266(CHEMBL3339223 | US9603889, Example 8)
Affinity DataIC50:  10nM. Assay description: Inhibition of XIAP-BIR3 (unknown origin) by HTRF assay
In DepthDetails ArticlePubMed
TargetBaculoviral IAP repeat-containing protein 2/E3 ubiquitin-protein ligase XIAP(Homo sapiens (Human))
Bristol-Myers Squibb
US Patent
LigandPNGBDBM50030266(CHEMBL3339223 | US9603889, Example 8)
Affinity DataIC50:  30nM. Assay description: Assays were performed in white, flat-bottom, 384-well ProxiPlates (Perkin Elmer). The final assay volume was 10 μL prepared from additions of Hi...
In DepthDetails US Patent
TargetBaculoviral IAP repeat-containing protein 3/E3 ubiquitin-protein ligase XIAP(Homo sapiens (Human))
Bristol-Myers Squibb
US Patent
LigandPNGBDBM50030266(CHEMBL3339223 | US9603889, Example 8)
Affinity DataIC50:  60nM. Assay description: Assays were performed in black, flat-bottom, 384-well plates. The final assay volume was 50 μL prepared from additions of N-His-Tb-BIR3(241-356,...
In DepthDetails US Patent
TargetBaculoviral IAP repeat-containing protein 2(Homo sapiens (Human))
Bristol-Myers Squibb Research & Development
Curated by ChEMBL
LigandPNGBDBM50030266(CHEMBL3339223 | US9603889, Example 8)
Affinity DataIC50:  5nM. Assay description: Inhibition of cIAP1 BIR2-3 (unknown origin) assessed as inhibition of polarization activity using N-His-Tb-cBir2-3(154-352) by fluorescence polarizat...
In DepthDetails ArticlePubMed