BDBM50030347 (R)-4-Mercapto-2-[(S)-3-phenyl-2-(3-phenyl-propionylamino)-propionylamino]-butyric acid::CHEMBL139624
SMILES OC(=O)[C@@H](CCS)NC(=O)[C@H](Cc1ccccc1)NC(=O)CCc1ccccc1
InChI Key InChIKey=PNSHFPPDCLOSSV-MOPGFXCFSA-N
Data  1 IC50
  Tab Delimited (TSV)   2D SDfile   Computed 3D by Vconf -m prep SDfile
Find this compound or compounds like it in BindingDB:
Activity Spreadsheet -- Enzyme Inhibition Constant Data from BindingDB
Found 1 hit for monomerid = 50030347
TargetPeptidylglycine alpha-amidating monooxygenase(Rattus norvegicus)
Ciba-Geigy
Curated by ChEMBL
LigandPNGBDBM50030347((R)-4-Mercapto-2-[(S)-3-phenyl-2-(3-phenyl-propion...)
Affinity DataIC50:  610nM. Assay description: Inhibitory activity against peptidylglycine alpha-amidating monooxygenase (PAM) was determined
In DepthDetails ArticlePubMed