BDBM50030461 CHEMBL3344320
SMILES [H][C@@]12CCCN1C(=O)[C@@H](Cc1ccccc1)NC(=O)[C@@H](CC(C)C)NC(=O)[C@H](CCCN)NC(=O)[C@@H](NC(=O)[C@@H](Cc1ccc(O)cc1)N[C@H](CCC(O)=O)C(=O)N[C@@H](CC(N)=O)C(=O)[C@@H](Cc1ccccc1)NC(=O)[C@H](Cc1ccccc1)NC2=O)C(C)C
InChI Key InChIKey=NLJVXZFCYKWXLH-BXBUVXQFSA-N
Data  1 KI
  Tab Delimited (TSV)   2D SDfile   Computed 3D by Vconf -m prep SDfile
Find this compound or compounds like it in BindingDB:
Activity Spreadsheet -- Enzyme Inhibition Constant Data from BindingDB
Found 1 hit for monomerid = 50030461
TargetGenome polyprotein(West Nile virus)
University Of Kwazulu-Natal
Curated by ChEMBL
LigandPNGBDBM50030461(CHEMBL3344320)
Affinity DataKi:  2.00E+3nM. Assay description: Inhibition of West Nile virus NS2B-NS3 protease
In DepthDetails ArticlePubMed