BDBM50031307 CHEMBL3357576
SMILES Clc1cc(NC(=O)c2ccccn2)ccc1N1C(=O)c2cccc(Br)c2C1=O
InChI Key InChIKey=KMESJSGTUSEKQW-UHFFFAOYSA-N
Data  2 IC50
  Tab Delimited (TSV)   2D SDfile   Computed 3D by Vconf -m prep SDfile
Find this compound or compounds like it in BindingDB:
Activity Spreadsheet -- Enzyme Inhibition Constant Data from BindingDB
Found 2 hits for monomerid = 50031307
TargetMetabotropic glutamate receptor 4(Rattus norvegicus (Rat))
Massachusetts General Hospital
Curated by ChEMBL
LigandPNGBDBM50031307(CHEMBL3357576)
Affinity DataIC50:  12nM. Assay description: Displacement of [3H]ML128 from rat mGlu4 receptor expressed in CHO cells after 30 mins by liquid scintillation counting analysis
In DepthDetails ArticlePubMed
TargetMetabotropic glutamate receptor 4(Rattus norvegicus (Rat))
Massachusetts General Hospital
Curated by ChEMBL
LigandPNGBDBM50031307(CHEMBL3357576)
Affinity DataIC50:  12nM. Assay description: Displacement of [3H]ML128 from rat mGlu4 receptor expressed in CHO cells after 30 mins by liquid scintillation counting analysis
In DepthDetails ArticlePubMed