BDBM50031426 (S)-2-[(S)-2-((S)-2-Amino-propionylamino)-3-naphthalen-2-yl-propionylamino]-4-methyl-pentanoic acid [(S)-1-((S)-1-carbamoyl-4-guanidino-butylcarbamoyl)-3-methyl-butyl]-amide::CHEMBL134081
SMILES CC(C)C[C@H](NC(=O)[C@H](CC(C)C)NC(=O)[C@H](Cc1ccc2ccccc2c1)NC(=O)[C@H](C)N)C(=O)N[C@@H](CCCNC(N)=N)C(N)=O
InChI Key InChIKey=IQSOREDSZMYXIN-OZDPOCAXSA-N
Data  1 EC50
  Tab Delimited (TSV)   2D SDfile   Computed 3D by Vconf -m prep SDfile
Find this compound or compounds like it in BindingDB:
Activity Spreadsheet -- Enzyme Inhibition Constant Data from BindingDB
Found 1 hit for monomerid = 50031426
TargetProteinase-activated receptor 1(Homo sapiens (Human))
Merck Research Laboratories
Curated by ChEMBL
LigandPNGBDBM50031426((S)-2-[(S)-2-((S)-2-Amino-propionylamino)-3-naphth...)
Affinity DataEC50:  1.90E+4nM. Assay description: Evaluated for the activation of human thrombin receptor measured by platelet aggregation
In DepthDetails ArticlePubMed