BDBM50031494 CHEMBL3358537
SMILES CCCC[C@H](NC(C)=O)C(=O)N[C@@H](CCCCN=[N+]=[N-])C(=O)N[C@@H](Cc1cnc[nH]1)C(=O)N[C@H](Cc1ccccc1)C(=O)N[C@@H](CCCNC(N)=N)C(=O)N[C@@H](Cc1c[nH]c2ccccc12)C(=O)N[C@@H](CC#C)C(N)=O
InChI Key InChIKey=DIDFXWFVHNRNMN-PMHRFVFWSA-N
Data  4 EC50
  Tab Delimited (TSV)   2D SDfile   Computed 3D by Vconf -m prep SDfile
Find this compound or compounds like it in BindingDB:
Activity Spreadsheet -- Enzyme Inhibition Constant Data from BindingDB
Found 4 hits for monomerid = 50031494
TargetMelanocortin receptor 5(Mus musculus (Mouse))
University Of Cergy-Pontoise
Curated by ChEMBL
LigandPNGBDBM50031494(CHEMBL3358537)
Affinity DataEC50:  1.90nM. Assay description: Activity at mouse MC5R expressed in HEK293 cells assessed as cAMP accumulation by CRE/beta-galactosidase reporter gene assay
In DepthDetails ArticlePubMed
TargetMelanocyte-stimulating hormone receptor(Mus musculus)
University Of Cergy-Pontoise
Curated by ChEMBL
LigandPNGBDBM50031494(CHEMBL3358537)
Affinity DataEC50:  0.240nM. Assay description: Activity at mouse MC1R expressed in HEK293 cells assessed as cAMP accumulation by CRE/beta-galactosidase reporter gene assay
In DepthDetails ArticlePubMed
TargetMelanocortin receptor 3(Mus musculus)
University Of Cergy-Pontoise
Curated by ChEMBL
LigandPNGBDBM50031494(CHEMBL3358537)
Affinity DataEC50:  1.90nM. Assay description: Activity at mouse MC3R expressed in HEK293 cells assessed as cAMP accumulation by CRE/beta-galactosidase reporter gene assay
In DepthDetails ArticlePubMed
TargetMelanocortin receptor 4(Mus musculus)
University Of Cergy-Pontoise
Curated by ChEMBL
LigandPNGBDBM50031494(CHEMBL3358537)
Affinity DataEC50:  0.810nM. Assay description: Activity at mouse MC4R expressed in HEK293 cells assessed as cAMP accumulation by CRE/beta-galactosidase reporter gene assay
In DepthDetails ArticlePubMed