BDBM50031648 1-(4-Benzyloxy-3-hydroxy-phenyl)-2-dimethylaminomethyl-propenone; hydrochloride::CHEMBL542887
SMILES CN(C)CC(=C)C(=O)c1ccc(OCc2ccccc2)c(O)c1
InChI Key InChIKey=BOXXZXNYZHHZNA-UHFFFAOYSA-N
Data  3 IC50
  Tab Delimited (TSV)   2D SDfile   Computed 3D by Vconf -m prep SDfile
Find this compound or compounds like it in BindingDB:
Activity Spreadsheet -- Enzyme Inhibition Constant Data from BindingDB
Found 3 hits for monomerid = 50031648
TargetProto-oncogene tyrosine-protein kinase Src(Homo sapiens (Human))
Ciba
Curated by ChEMBL
LigandPNGBDBM50031648(1-(4-Benzyloxy-3-hydroxy-phenyl)-2-dimethylaminome...)
Affinity DataIC50:  5.00E+4nM. Assay description: In vitro inhibition of the c-src tyrosine kinase activity in A431 membranes using angiotensin II as phosphate acceptor as substrate
In DepthDetails ArticlePubMed
TargetEpidermal growth factor receptor(Homo sapiens (Human))
Ciba
Curated by ChEMBL
LigandPNGBDBM50031648(1-(4-Benzyloxy-3-hydroxy-phenyl)-2-dimethylaminome...)
Affinity DataIC50:  670nM. Assay description: In vitro inhibition of the Epidermal growth factor receptor activity in A431 membranes
In DepthDetails ArticlePubMed
TargetTyrosine-protein kinase ABL1(Homo sapiens (Human))
Ciba
Curated by ChEMBL
LigandPNGBDBM50031648(1-(4-Benzyloxy-3-hydroxy-phenyl)-2-dimethylaminome...)
Affinity DataIC50: >5.00E+4nM. Assay description: In vitro inhibition of the v-abl tyrosine kinase activity in A431 membranes using angiotensin II as phosphate acceptor as substrate
In DepthDetails ArticlePubMed