BDBM50031732 CHEMBL3360308
SMILES COc1cccc(n1)-c1ccc(F)cc1[C@H]1Cc2nc(N)nc(C)c2C(=O)N1
InChI Key InChIKey=XLMJRDQLZYJXGV-OAHLLOKOSA-N
Data  1 IC50
  Tab Delimited (TSV)   2D SDfile   Computed 3D by Vconf -m prep SDfile
Find this compound or compounds like it in BindingDB:
Activity Spreadsheet -- Enzyme Inhibition Constant Data from BindingDB
Found 1 hit for monomerid = 50031732
TargetHeat shock protein HSP 90-alpha(Homo sapiens (Human))
Novartis Institutes For Biomedical Research
Curated by ChEMBL
LigandPNGBDBM50031732(CHEMBL3360308)
Affinity DataIC50:  37nM. Assay description: Inhibition of N-terminal His-tagged HSP90-alpha (unknown origin) after 2 hrs by spectrophotometry
In DepthDetails ArticlePubMed