BDBM50031793 (R)-6-Hydroxycarbamoyl-5-((S)-1-methylcarbamoyl-2-phenyl-ethylcarbamoyl)-hexanoic acid::CHEMBL85933
SMILES CNC(=O)[C@H](Cc1ccccc1)NC(=O)[C@H](CCCC(O)=O)CC(=O)NO
InChI Key InChIKey=NBDGYUOAVSOSOD-KGLIPLIRSA-N
Data  6 KI
  Tab Delimited (TSV)   2D SDfile   Computed 3D by Vconf -m prep SDfile
Find this compound or compounds like it in BindingDB:
Activity Spreadsheet -- Enzyme Inhibition Constant Data from BindingDB
Found 6 hits for monomerid = 50031793
TargetNeutrophil collagenase(Homo sapiens (Human))
Sterling Winthrop Pharmaceuticals Research Division
Curated by ChEMBL
LigandPNGBDBM50031793((R)-6-Hydroxycarbamoyl-5-((S)-1-methylcarbamoyl-2-...)
Affinity DataKi:  270nM. Assay description: Inhibition of human neutrophil collagenase(HNC), MMP-8
In DepthDetails ArticlePubMed
TargetNeutrophil collagenase(Homo sapiens (Human))
Sterling Winthrop Pharmaceuticals Research Division
Curated by ChEMBL
LigandPNGBDBM50031793((R)-6-Hydroxycarbamoyl-5-((S)-1-methylcarbamoyl-2-...)
Affinity DataKi:  270nM. Assay description: Inhibition of human neutrophil collagenase, matrix metalloproteinase-8
In DepthDetails Article
TargetInterstitial collagenase(Homo sapiens (Human))
TBA
Curated by ChEMBL
LigandPNGBDBM50031793((R)-6-Hydroxycarbamoyl-5-((S)-1-methylcarbamoyl-2-...)
Affinity DataKi:  3.35E+3nM. Assay description: Inhibition of human fibroblast collagenase, matrix metalloproteinase-1
In DepthDetails Article
TargetInterstitial collagenase(Homo sapiens (Human))
TBA
Curated by ChEMBL
LigandPNGBDBM50031793((R)-6-Hydroxycarbamoyl-5-((S)-1-methylcarbamoyl-2-...)
Affinity DataKi:  3.35E+3nM. Assay description: Inhibitory potency against human fibroblast collagenase, MMP-1
In DepthDetails ArticlePubMed
TargetStromelysin-1(Homo sapiens (Human))
TBA
Curated by ChEMBL
LigandPNGBDBM50031793((R)-6-Hydroxycarbamoyl-5-((S)-1-methylcarbamoyl-2-...)
Affinity DataKi: >1.00E+4nM. Assay description: Inhibition of human fibroblast stromelysin, matrix metalloproteinase-3
In DepthDetails Article
TargetStromelysin-1(Homo sapiens (Human))
TBA
Curated by ChEMBL
LigandPNGBDBM50031793((R)-6-Hydroxycarbamoyl-5-((S)-1-methylcarbamoyl-2-...)
Affinity DataKi: >1.00E+4nM. Assay description: Inhibitory potency against human stromelysin, MMP-3
In DepthDetails ArticlePubMed