BDBM50032113 2-[2-(4-Fluoro-2-methyl-phenylamino)-4-(methyl-phenyl-amino)-quinazolin-8-yloxy]-ethanol::CHEMBL96619::TCMDC-142334
SMILES CN(c1ccccc1)c1nc(Nc2ccc(F)cc2C)nc2c(OCCO)cccc12
InChI Key InChIKey=ONYBTOHSSKYVDS-UHFFFAOYSA-N
Data  1 IC50
  Tab Delimited (TSV)   2D SDfile   Computed 3D by Vconf -m prep SDfile
Find this compound or compounds like it in BindingDB:
Activity Spreadsheet -- Enzyme Inhibition Constant Data from BindingDB
Found 1 hit for monomerid = 50032113
TargetPotassium-transporting ATPase alpha chain 1/subunit beta(Sus scrofa (Pig))
Smithkline Beecham Pharmaceuticals R&D
Curated by ChEMBL
LigandPNGBDBM50032113(2-[2-(4-Fluoro-2-methyl-phenylamino)-4-(methyl-phe...)
Affinity DataIC50:  100nM. Assay description: Inhibition of K+ stimulated gastric ATPase activity
In DepthDetails ArticlePubMed