BDBM50032285 CHEMBL3353498
SMILES CN(Cc1ccc(Cl)cc1)C(=O)C1(C)CCN1C(=O)c1csc2ccccc12
InChI Key InChIKey=PQNBMFORWVCMMH-UHFFFAOYSA-N
Data  1 IC50
  Tab Delimited (TSV)   2D SDfile   Computed 3D by Vconf -m prep SDfile
Find this compound or compounds like it in BindingDB:
Activity Spreadsheet -- Enzyme Inhibition Constant Data from BindingDB
Found 1 hit for monomerid = 50032285
TargetFree fatty acid receptor 2(Homo sapiens (Human))
Galapagos
Curated by ChEMBL
LigandPNGBDBM50032285(CHEMBL3353498)
Affinity DataIC50:  142nM. Assay description: Antagonist activity against human FFA2 receptor expressed in HEK293 cells assessed as inhibition of sodium acetate-induced calcium mobilization
In DepthDetails ArticlePubMed