BDBM50032491 2-(4-Carbamimidoylsulfanyl-butyl)-isothiourea::CHEMBL104233
SMILES NC(=N)SCCCCSC(N)=N
InChI Key InChIKey=PTMXPRBEWOQFQC-UHFFFAOYSA-N
Data  1 IC50
  Tab Delimited (TSV)   2D SDfile   Computed 3D by Vconf -m prep SDfile
Find this compound or compounds like it in BindingDB:
Activity Spreadsheet -- Enzyme Inhibition Constant Data from BindingDB
Found 1 hit for monomerid = 50032491
TargetDeoxyhypusine synthase(Rattus norvegicus)
National Institute Of Dental Research
Curated by ChEMBL
LigandPNGBDBM50032491(2-(4-Carbamimidoylsulfanyl-butyl)-isothiourea | CH...)
Affinity DataIC50: >1.00E+6nM. Assay description: In vitro IC50 value by measuring the inhibition of deoxyhypusine synthase.
In DepthDetails ArticlePubMed