BDBM50032501 CHEMBL318516::N*1*-(6-Amino-hexyl)-hexane-1,6-diamine::N-(6-AMINOHEXYL)HEXANE-1,6-DIAMINE
SMILES NCCCCCCNCCCCCCN
InChI Key InChIKey=MRNZSTMRDWRNNR-UHFFFAOYSA-N
Data  1 IC50
PDB links: 1 PDB ID matches this monomer.
  Tab Delimited (TSV)   2D SDfile   Computed 3D by Vconf -m prep SDfile
Find this compound or compounds like it in BindingDB:
Activity Spreadsheet -- Enzyme Inhibition Constant Data from BindingDB
Found 1 hit for monomerid = 50032501
TargetDeoxyhypusine synthase(Rattus norvegicus)
National Institute Of Dental Research
Curated by ChEMBL
LigandPNGBDBM50032501(CHEMBL318516 | N*1*-(6-Amino-hexyl)-hexane-1,6-dia...)
Affinity DataIC50: >1.00E+6nM. Assay description: In vitro IC50 value by measuring the inhibition of deoxyhypusine synthase.
In DepthDetails ArticlePubMed